chancelière
created: 2012-05-16T00:00:00+02:00
modified: 2014-10-10T15:48:35+02:00
status: 1
type: Concept
broad match: http://data.bnf.fr/ark:/12148/cb131627639
broad match: Siège (meuble)
broad match: http://vocab.getty.edu/aat/300037769
broader: T69-2684
definition: Sorte de caisse à côtés triangulaires ou rectangulaires, posée au sol, servant à tenir les pieds au chaud quand on est assis sur un siège. Elle est ouverte sur un pan et l'intérieur est garni de fourrure. Elle peut être garnie de textile à l'extérieur.
in scheme: T69
preferred label: footwarmers @en-us