tabouret de pied
created: 2012-05-16T00:00:00+02:00
modified: 2014-12-04T12:07:37+01:00
status: 1
type: Concept
broad match: cb13185166t
broader: T69-2684
definition: Meuble généralement de même structure que le tabouret ou le banc, mais plus bas : on y pose les pieds quand on est assis.
in scheme: T69
preferred label: footstools (stools) @en-us