berceau
created: 2012-05-16T00:00:00+02:00
modified: 2014-12-04T11:16:39+01:00
status: 1
type: Concept
alternative label: moïse
broader: T69-2694
definition: Meuble constitué d'une caisse ou d'une corbeille destinée à coucher un bébé. Le berceau est sans pieds ou comporte des pieds ordinaires ou des traverses à bascule généralement transversales. Il peut être portatif (moïse), reposer sur un support spécifique ou improvisé, ou encore être suspendu.
in scheme: T69
preferred label: cradles @en-us