lit de repos
created: 2012-05-16T00:00:00+02:00
modified: 2014-12-04T11:36:48+01:00
status: 1
type: Concept
alternative label: méridienne
broad match: http://data.bnf.fr/ark:/12148/cb131627263
broader: T69-2703
definition: Lit de jour constitué d'un plan allongé étroit comportant au moins un chevet. S'il en comporte deux, ceux-ci ne sont pas nécessairement de hauteur égale. La méridienne est à deux chevets d'inégale hauteur réunis par un dossier incliné.
in scheme: T69
preferred label: daybeds @en-us