meuble de maintien pour enfant
created: 2012-05-16T00:00:00+02:00
modified: 2014-10-10T16:36:51+02:00
status: 1
type: Concept
broad match: cb11980671p
broad match: Meuble
broader: T69-2636
definition: Meuble destiné à l’enfant, pour le promener, le garder ou encore lui apprendre à marcher.
in scheme: T69
narrower: T69-2715
narrower: T69-2718
narrower: T69-2720
narrower: T69-2722