chevalet à enfant
created: 2012-05-16T00:00:00+02:00
modified: 2014-12-04T12:38:30+01:00
status: 1
type: Concept
broad match: cb11980671p
broader: T69-2714
definition: Petit meuble pliant constitué d'un plan incliné portant une planchette à la base et un ou deux arceaux fichés à mi-hauteur, dans lequel on glisse un enfant emmailloté pour le garder.
in scheme: T69