étui à enfant
created: 2012-05-16T00:00:00+02:00
modified: 2014-09-10T15:54:59+02:00
status: 1
type: Concept
broad match: cb11980671p
broader: T69-2714
definition: Meuble dans lequel on place un enfant pour lui apprendre à se tenir debout. Il se présente sous forme de cylindre vertical à fond plein, posé au sol. Il est en bois, en écorce de liège, en boudins de paille ou en roseaux assemblés.
in scheme: T69