promenoir pour enfant
created: 2012-05-16T00:00:00+02:00
modified: 2014-12-04T12:40:13+01:00
status: 1
type: Concept
alternative label: barre à enfant
alternative label: promenoir fixe
alternative label: promenoir roulant
alternative label: promenoir à poulie
alternative label: tourniquet bas
alternative label: tourniquet haut
broad match: cb11980671p
broader: T69-2714
definition: Meuble en bois, en osier ou en métal servant à maintenir l'enfant sous les bras et lui apprendre à marcher. Il peut être posé au sol ou suspendu au plafond ou à une barre haute.
in scheme: T69
preferred label: walkers @en-us