table à ouvrage
terme associe: T69-4715
terme associe: T69-4728
created: 2012-05-16T00:00:00+02:00
modified: 2014-12-05T13:24:55+01:00
status: 1
type: Concept
alternative label: table de fileuse
alternative label: table à ouvrage en coffret
alternative label: table à ouvrage à nécessaire
broader: T69-2730
definition: Petite table à éléments de rangement servant à contenir les objets nécessaires aux travaux de couture, broderie, tapisserie, tricot. De plan massé (carrée, rectangulaire, circulaire, etc), elle se présente sous forme de coffret ou de table à un ou plusieurs tiroirs et comporte de un à quatre pieds.
in scheme: T69
narrower: T69-2776
narrower: T69-2778
narrower: T69-2780
preferred label: work tables @en-us
related: T69-4715
related: T69-4728