billard
terme associe: T69-6976
created: 2012-05-16T00:00:00+02:00
modified: 2014-12-05T13:49:23+01:00
status: 1
type: Concept
alternative label: billard anglais
alternative label: billard français
alternative label: billard à blouses
broader: T69-2784
definition: Table à jeu rectangulaire dont le plateau est recouvert de drap vert et les rebords sont rembourrés. Le billard français ne comporte aucun trou. Le billard anglais ou à blouses en compte six.
in scheme: T69
preferred label: billiard tables & pool tables @en-us
related: T69-6976