bonheur du jour
created: 2012-05-16T00:00:00+02:00
modified: 2014-12-05T13:50:17+01:00
status: 1
type: Concept
broader: T69-2784
definition: Petite table à écrire, rectangulaire ou ovale, dont l'écritoire est constituée par une tablette tirante et dont le dessus comporte un gradin. Ce meuble peut comporter une tablette d'entrejambe, souvent échancrée, ou un corps inférieur à battants.
in scheme: T69
preferred label: bonheurs-du-jour @en-us