bureau
terme associe: T69-3558
created: 2012-05-16T00:00:00+02:00
modified: 2014-12-05T13:56:46+01:00
status: 1
type: Concept
broader: T69-2784
definition: Table dont le dessus est généralement couvert de drap de velours ou de cuir, qui sert à écrire et peut être utilisée simultanément par plusieurs personnes. Le bureau peut comporter des tiroirs et des tablettes coulissantes dans la ceinture, et éventuellement des caissons latéraux constitués de tiroirs supplémentaires (par rapport à ceux de la ceinture).
in scheme: T69
narrower: T69-2794
preferred label: desks @en-us
related: T69-3558