table à dessin
created: 2012-05-16T00:00:00+02:00
modified: 2014-12-05T13:58:21+01:00
status: 1
type: Concept
alternative label: table de dessin
alternative label: table de peinture
broader: T69-2784
definition: Table servant à dessiner dont le plateau est réglable en hauteur et/ou inclinable ou table dont le dessus est garni de tissu ou de cuir et dont le tiroir comporte des cases à crayons et compas (et non pas à encrier et éponge comme la table à écrire).
in scheme: T69
preferred label: drawing tables (artists' tables) @en-us