escabeau
terme associe: T69-3226
created: 2012-05-16T00:00:00+02:00
modified: 2014-12-05T12:26:48+01:00
status: 1
type: Concept
broad match: http://data.bnf.fr/ark:/12148/cb131627639
broader: T69-6867
definition: Siège d'une place sans dossier dont le dessus est en bois plein. Il est monté sur pieds ou sur panneaux verticaux et affecte des formes diverses.
in scheme: T69
preferred label: wooden stools @en-us
related: T69-3226