table de salon
created: 2012-05-16T00:00:00+02:00
modified: 2014-12-05T14:03:51+01:00
status: 1
type: Concept
alternative label: table de famille
broad match: Table
broader: T69-2784
definition: Table de milieu, destinée au salon et pouvant comporter un plateau très orné et éventuellement en relief, totalement recouvert de tissu.
in scheme: T69
preferred label: center tables @en-us