armoire à archives
terme associe: T69-3105
terme associe: T69-859
created: 2012-05-16T00:00:00+02:00
modified: 2014-12-04T15:21:12+01:00
status: 1
type: Concept
alternative label: armoire à archives de communauté
broad match: http://data.bnf.fr/ark:/12148/cb13163615d
broader: T69-2841
definition: Armoire où l'on range des papiers (titres de propriétés, etc).
in scheme: T69
preferred label: archives cupboards @en-us
related: T69-3105
related: T69-859