boîte à lettres
terme associe: T69-465
created: 2012-05-16T00:00:00+02:00
modified: 2014-12-04T15:50:21+01:00
status: 1
type: Concept
broader: T69-2895
definition: Petite caisse fermée à clef, mobile ou d'applique, comportant une fente permettant de glisser le courrier. Ce meuble, lorsqu'il est réservé au courrier en partance, peut être beaucoup plus soigné puisqu'il est utilisé à l'intérieur.
in scheme: T69
preferred label: mailboxes @en-us
related: T69-465