pouf
created: 2012-05-16T00:00:00+02:00
modified: 2014-12-05T12:58:05+01:00
status: 1
type: Concept
broad match: http://data.bnf.fr/ark:/12148/cb131627639
broader: T69-6867
definition: Tabouret rembourré sans accotoirs et sans pieds visibles.
in scheme: T69
preferred label: hassocks @en-us