coffre à grains
created: 2012-05-16T00:00:00+02:00
modified: 2014-12-04T16:12:04+01:00
status: 1
type: Concept
broader: T69-2924
definition: Coffre servant à conserver le grain, les légumes ou les fruits secs. Il comporte souvent des divisions internes servant à séparer les divers aliments.
in scheme: T69
narrower: T69-2934
preferred label: grain bins @en-us