saloir à saler
created: 2012-05-16T00:00:00+02:00
modified: 2014-12-04T16:15:52+01:00
status: 1
type: Concept
broader: T69-2924
definition: Meuble servant à conserver dans le sel non moulu certaines denrées spécifiques. Il se présente sous forme de coffre en bois ou en pierre ou de cavité dans le mur.
in scheme: T69