coffre de communauté laïque
terme associe: T69-866
created: 2012-05-16T00:00:00+02:00
modified: 2014-10-13T10:48:03+02:00
status: 1
type: Concept
broad match: cb13162914n
broad match: Coffre
broad match: http://vocab.getty.edu/aat/300038992
broader: T69-2908
definition: Coffre appartenant à un groupe religieux, civil ou professionnel, servant à mettre des archives ou des dons en nature, et comportant plusieurs serrures commandées par des clefs différentes, de façon à ce que le contenu ne puisse être retiré qu'en présence de plusieurs responsables.
in scheme: T69
related: T69-866