cartonnier
created: 2012-05-16T00:00:00+02:00
modified: 2014-12-05T10:21:00+01:00
status: 1
type: Concept
broad match: http://vocab.getty.edu/aat/300038936
broader: T69-3105
definition: Classeur à archives constitué de tiroirs en carton souvent recouverts de cuir, parfois numérotés ou porteurs d'inscriptions. Ces cartons, une fois tirés, présentent un dessus mobile.
in scheme: T69