meuble d'hygiène
created: 2012-05-16T00:00:00+02:00
modified: 2014-10-10T16:02:54+02:00
status: 1
type: Concept
alternative label: nécessaire d'aisances
alternative label: pied porte-coiffure
alternative label: porte-nécessaire d'aisances
alternative label: porte-seau de toilette
broader: T69-2636
definition: Meuble lié à l’hygiène et aux soins du corps.
in scheme: T69
narrower: T69-3114
narrower: T69-3117
narrower: T69-3121
narrower: T69-3126
narrower: T69-3128
narrower: T69-3136
narrower: T69-3138
narrower: T69-3151
narrower: T69-3156
narrower: T69-3158
narrower: T69-6889