baignoire
created: 2012-05-16T00:00:00+02:00
modified: 2014-12-04T12:22:35+01:00
status: 1
type: Concept
alternative label: baignoire sabot
broader: T69-3113
definition: Grande cuve comportant un trou d'écoulement et éventuellement un trop-plein dans laquelle on s’immerge en position assise ou allongée. Cette cuve est fixe et parfois maçonnée ou mobile grâce à des poignées et/ou des roulettes. Elle est alimentée à la main ou par un réservoir supérieur ou encore par l'eau courante.
in scheme: T69
preferred label: bathtubs @en-us