bain de siège
created: 2012-05-16T00:00:00+02:00
modified: 2014-12-04T12:22:59+01:00
status: 1
type: Concept
alternative label: chaise bain de siège
alternative label: fauteuil bain de siège
broad match: http://data.bnf.fr/ark:/12148/cb119415458
broader: T69-3113
definition: Cuve généralement semi-sphérique ou semi-ovoïde, de moindres dimensions par rapport à la baignoire, servant à s'installer accroupi, l'eau arrivant à la ceinture et à mi-cuisses. La cuve peut comporter un écoulement.
in scheme: T69
preferred label: sitz baths @en-us