bidet
terme associe: T69-4253
terme associe: T69-4332
created: 2012-05-16T00:00:00+02:00
modified: 2014-12-04T12:26:37+01:00
status: 1
type: Concept
alternative label: bidet à clystère
broader: T69-3113
definition: Cuvette en forme de demi-poire, parfois à écoulement, permettant de se mettre à cheval pour la toilette intime. La cuvette est intégrée dans une caisse montée sur pieds. Le bidet fixe est monté directement sur pied unique et reçoit généralement l'eau courante.
in scheme: T69
preferred label: bidets (plumbing fixtures) @en-us
related: T69-4253
related: T69-4332