douche
created: 2012-05-16T00:00:00+02:00
modified: 2014-10-10T16:08:56+02:00
status: 1
type: Concept
broader: T69-3113
definition: Cuvette à écoulement inférieur accompagnée d'un réservoir supérieur fixe, rempli manuellement ou par eau courante, servant à se laver par aspersion.
in scheme: T69
preferred label: shower baths @en-us