armoire-lavabo
created: 2012-05-16T00:00:00+02:00
modified: 2014-10-10T16:12:16+02:00
status: 1
type: Concept
broader: T69-3128
definition: Table à lavabo dissimulée dans une armoire haute.
in scheme: T69
preferred label: washstands @en-us