porte-fontaine lavabo
terme associe: T69-4197
terme associe: T69-4229
created: 2012-05-16T00:00:00+02:00
modified: 2014-12-04T12:31:17+01:00
status: 1
type: Concept
broad match: http://data.bnf.fr/ark:/12148/cb119415458
broader: T69-3128
definition: Support d’applique, d’encoignure ou, rarement, de milieu, servant à porter un réservoir de fontaine surmontant un bassin, pour le lavage essentiellement des mains.
in scheme: T69
preferred label: basin stands @en-us
related: T69-4197
related: T69-4229