table-lavabo
terme associe: T69-4221
terme associe: T69-4235
created: 2012-05-16T00:00:00+02:00
modified: 2014-12-04T12:32:25+01:00
status: 1
type: Concept
broader: T69-3128
definition: Table comportant en son centre une cavité dans laquelle s'introduit une cuvette, éventuellement à écoulement servant à se laver. Elle est parfois accompagnée d'un porte-linge de toilette latéral et surmontée d'un miroir et de tablettes.
in scheme: T69
related: T69-4221
related: T69-4235