siège percé
created: 2012-05-16T00:00:00+02:00
modified: 2014-10-10T16:34:12+02:00
status: 1
type: Concept
broad match: http://data.bnf.fr/ark:/12148/cb119415458
broader: T69-3113
definition: Siège à fond percé d'un trou, servant aux nécessités. Le récipient était posé au sol ou sur une tablette d'entrejambe.
in scheme: T69
preferred label: close-stools @en-us