tabouret
created: 2012-05-16T00:00:00+02:00
modified: 2014-12-05T13:02:31+01:00
status: 1
type: Concept
alternative label: pliant
broader: T69-6867
definition: Siège d'une place, sans dossier, garni ou non. Le tabouret d’encoignure comprend un angle droit.
in scheme: T69
preferred label: stools (seating furniture) @en-us