meuble de protection
created: 2012-05-16T00:00:00+02:00
modified: 2014-10-10T17:03:34+02:00
status: 1
type: Concept
broad match: Meuble
broad match: http://vocab.getty.edu/aat/300037680
broader: T69-2636
definition: Structure ou élément de séparation, de protection ou de camouflage.
in scheme: T69
narrower: T69-3201
narrower: T69-3203
narrower: T69-3205
narrower: T69-3207
narrower: T69-3209
narrower: T69-3211
narrower: T69-3215
narrower: T69-3217
narrower: T69-3219