trumeau de cheminée
terme associe: T69-3525
terme associe: T69-4825
terme associe: T69-4881
created: 2012-05-16T00:00:00+02:00
modified: 2015-01-07T15:58:34+01:00
status: 1
type: Concept
alternative label: cheminée de glace
broad match: cb11931172v
broader: T69-319
definition: Pan de mur entre deux baies situées au même niveau. Par extension, le terme désigne la peinture ou le panneau de glace qui l'occupe. Par extension encore, le terme s'applique à la partie saillante de la hotte de cheminée, souvent ornée d'une glace et/ou d'un tableau.
in scheme: T69
preferred label: overmantels (interior wall components) @en-us
related: T69-3525
related: T69-4825
related: T69-4881