écran pare-étincelles
created: 2012-05-16T00:00:00+02:00
modified: 2014-10-10T17:12:20+02:00
status: 1
type: Concept
alternative label: garde-feu
alternative label: pare-feu
broader: T69-3200
definition: Meuble constitué d'un ou plusieurs plans articulés, en métal finement ajouré ou en verre, placé devant la cheminée pour protéger la pièce des flammèches.
in scheme: T69
preferred label: fire screens (equipment) @en-us