parasol
created: 2012-05-16T00:00:00+02:00
modified: 2014-12-04T15:17:27+01:00
status: 1
type: Concept
broad match: http://vocab.getty.edu/aat/300165810
broader: T69-3200
definition: Tige verticale surmontée d'une toile tendue en demi-sphère servant à protéger du soleil.
in scheme: T69
preferred label: sunshades @en-us