paravent
terme associe: T69-4768
created: 2012-05-16T00:00:00+02:00
modified: 2014-12-04T15:18:51+01:00
status: 1
type: Concept
broader: T69-3200
definition: Meuble composé de plans verticaux ou feuilles articulés, pouvant aller de deux à douze, parfois portés par des patins, servant à protéger des courants d'air, de la vue, du feu ou à diviser une pièce.
in scheme: T69
preferred label: screens (furniture) @en-us
related: T69-4768