parc d'enfant
created: 2012-05-16T00:00:00+02:00
modified: 2014-10-10T17:16:14+02:00
status: 1
type: Concept
broader: T69-3200
definition: Clôture à barreaux de plan carré ou circulaire servant à limiter les déplacements d'un enfant.
in scheme: T69
preferred label: playpens @en-us