échelle
created: 2012-05-16T00:00:00+02:00
modified: 2014-12-04T12:12:24+01:00
status: 1
type: Concept
broader: T69-3221
definition: Meuble constitué d'un ensemble de marches ou de barres horizontales superposées et servant à atteindre un objet ou un espace élevé.
in scheme: T69
narrower: T69-3224
preferred label: ladders @en-us