échelle de bibliothèque
created: 2012-05-16T00:00:00+02:00
modified: 2014-12-04T12:13:11+01:00
status: 1
type: Concept
broad match: cb13181565m
broad match: Échelle (outil)
broad match: http://vocab.getty.edu/aat/300022376
broader: T69-3222
definition: Echelle à marches, de facture soignée. Elle peut comporter une rampe latérale ou deux d'appui et/ou des garde-fous supérieurs, permettant d'atteindre les livres élevés des bibliothèques.
in scheme: T69