escabeau à marches
terme associe: T69-28
created: 2012-05-16T00:00:00+02:00
modified: 2014-12-04T12:14:15+01:00
status: 1
type: Concept
broad match: cb13162680m
broader: T69-3221
definition: Meuble constitué d'un ensemble de marches en retrait les unes par rapport aux autres, posées sur des montants verticaux et servant à accéder à un meuble ou un objet, relativement élevé.
in scheme: T69
narrower: T69-3228
narrower: T69-3230
preferred label: step stools @en-us
related: T69-28