escabeau de bibliothèque
created: 2012-05-16T00:00:00+02:00
modified: 2014-12-04T12:17:06+01:00
status: 1
type: Concept
broad match: cb13162680m
broader: T69-3226
definition: Escabeau à marches, de facture soignée, permettant d'atteindre les rayons élevés d'une bibliothèque. L'escabeau de bibliothèque se dissimule souvent sous l'apparence d'un fauteuil ou d'une chaise.
in scheme: T69
preferred label: library steps @en-us