marchepied
created: 2012-05-16T00:00:00+02:00
modified: 2014-12-04T12:17:57+01:00
status: 1
type: Concept
broad match: cb13162680m
broad match: Escabeau
broader: T69-3226
definition: Meuble bas constitué d'un ensemble de deux à quatre marches, éventuellement garni à bois recouvert, servant à monter dans un lit. Il peut comporter des mains de prise permettant de le déplacer.
in scheme: T69
preferred label: bed steps @en-us