porte-fontaine à eau potable
terme associe: T69-4197
created: 2012-05-16T00:00:00+02:00
modified: 2014-09-11T17:09:07+02:00
status: 1
type: Concept
broad match: http://vocab.getty.edu/aat/300006181
broader: T69-3235
definition: Support en forme de petite table basse circulaire ou rectangulaire, avec rebord dans la masse, ou cadre monté sur trois pieds bas, servant à recevoir la fontaine à eau potable laquelle comporte un (ou des) robinet(s) inférieur(s). Elle est placée dans la cuisine.
in scheme: T69
related: T69-4197