four à pâtisserie
created: 2012-05-16T00:00:00+02:00
modified: 2014-10-13T13:21:08+02:00
status: 1
type: Concept
broad match: http://data.bnf.fr/ark:/12148/cb119785071
broader: T69-3246
definition: Meuble en métal ou construction en maçonnerie à côté du four à pain, comportant uniquement un four chauffé par un foyer ou par le passage de la fumée d'un fourneau indépendant.
in scheme: T69
preferred label: bake ovens (baking devices) @en-us