meuble-foyer
created: 2012-05-16T00:00:00+02:00
modified: 2014-10-13T13:22:24+02:00
status: 1
type: Concept
broad match: cb13337214n
broad match: http://vocab.getty.edu/aat/300200422
broader: T69-3246
definition: Meuble servant à faire du feu avec des bûches et constitué d'une caisse de dimensions variables, montée sur pieds courts, remplie d'une couche d'argile et de dalles de schiste.
in scheme: T69