potence d'âtre
terme associe: T69-4497
terme associe: T69-4508
created: 2012-05-16T00:00:00+02:00
modified: 2014-12-05T10:53:41+01:00
status: 1
type: Concept
broad match: cb13337214n
broader: T69-3246
definition: Montant mobile en bois ou en fer, placé dans un âtre, auquel est assemblé un bras horizontal à l'extrémité duquel s'accroche la crémaillère portant le récipient pour la cuisson des aliments.
in scheme: T69
preferred label: gallows @en-us
related: T69-4497
related: T69-4508