table chauffante
created: 2012-05-16T00:00:00+02:00
modified: 2014-10-13T13:27:27+02:00
status: 1
type: Concept
alternative label: buffet chauffant
broad match: cb13337214n
broader: T69-3246
definition: Meuble formé soit d'une caisse élevée sur pieds à hauteur d'appui, doublée intérieurement de métal, portant un réchaud à alcool et dont le dessus est percé pour recevoir un récipient à réchauffer, soit d'une table à dessus de métal portant un réchaud d'entrejambe à pétrole.
in scheme: T69
preferred label: plate warmers @en-us