tarare
created: 2012-05-16T00:00:00+02:00
modified: 2014-12-04T15:03:57+01:00
status: 1
type: Concept
broad match: http://data.bnf.fr/ark:/12148/cb131630461
broader: T69-3282
definition: Meuble servant à trier les grains selon leur grosseur et à les séparer des éléments légers (paille, peaux, etc.) qui les accompagnent. Il peut être constitué d'un cylindre rotatif à grillage dont les fils ont un espacement de taille croissante.
in scheme: T69
preferred label: sifters @en-us