meuble pour lait ou fromage
terme associe: T69-3588
terme associe: T69-3605
created: 2012-05-16T00:00:00+02:00
modified: 2014-10-10T16:58:38+02:00
status: 1
type: Concept
alternative label: auge à saler le fromage
alternative label: couloir à fromage
alternative label: cuve à lait
alternative label: cuve à saumure
alternative label: malaxeur à beurre
alternative label: porte-baratte
alternative label: table à lait
broad match: http://vocab.getty.edu/aat/300199765
broader: T69-3281
definition: Meuble servant à une des étapes de la fabrication du beurre ou du fromage.
in scheme: T69
narrower: T69-3299
narrower: T69-3317
related: T69-3588
related: T69-3605